Reaction Details
TargetProteinase-activated receptor 4
LigandBDBM286439
Substrate/Competitorn/a
Meas. Tech.FLIPR Assay
Temperature298.15±n/a K
IC50 0.690±n/a nM
Commentsextracted
Citation Martel, ATremblay, FMarinier, APriestley, ESPosy, SLLawrence, RMMiller, MM Imidazothiadiazole and imidazopyridazine derivatives as protease activated receptor 4 (PAR4) inhibitors for treating platelet aggregation US Patent US9518064 Publication Date 12/13/2016
 
Proteinase-activated receptor 4
Name:Proteinase-activated receptor 4
Type:Protein
Mol. Mass.:41145.16
Organism:Homo sapiens (Human)
Description:Q96RI0
Residue:385
BDBM286439
NameBDBM286439
Synonyms:US9518064, Example 55
TypeSmall organic molecule
Emp. Form.C26H19FN4O4S
Mol. Mass.502.517
SMILESCOc1nn2cc(nc2s1)-c1cc2c(OCc3cccc(c3)-c3ccnc(F)c3)cc(OC)cc2o1