Reaction Details
TargetProteinase-activated receptor 4
LigandBDBM286478
Substrate/Competitorn/a
Meas. Tech.FLIPR Assay
Temperature298.15±n/a K
IC50 0.360±n/a nM
Commentsextracted
Citation Martel, ATremblay, FMarinier, APriestley, ESPosy, SLLawrence, RMMiller, MM Imidazothiadiazole and imidazopyridazine derivatives as protease activated receptor 4 (PAR4) inhibitors for treating platelet aggregation US Patent US9518064 Publication Date 12/13/2016
 
Proteinase-activated receptor 4
Name:Proteinase-activated receptor 4
Type:Protein
Mol. Mass.:41145.16
Organism:Homo sapiens (Human)
Description:Q96RI0
Residue:385
BDBM286478
NameBDBM286478
Synonyms:6-(4-((2-(2-fluoropyridin-4-yl)pyrimidin-4-yl)methoxy)-6-methoxybenzofuran-2-yl)-2-methoxyimidazo[2,1-b][1,3,4]thiadiazole | US9518064, Example 97
TypeSmall organic molecule
Emp. Form.C24H17FN6O4S
Mol. Mass.504.493
SMILESCOc1nn2cc(nc2s1)-c1cc2c(OCc3ccnc(n3)-c3ccnc(F)c3)cc(OC)cc2o1