Reaction Details
TargetProteinase-activated receptor 4
LigandBDBM286486
Substrate/Competitorn/a
Meas. Tech.FLIPR Assay
Temperature298.15±n/a K
IC50 1.06±n/a nM
Commentsextracted
Citation Martel, ATremblay, FMarinier, APriestley, ESPosy, SLLawrence, RMMiller, MM Imidazothiadiazole and imidazopyridazine derivatives as protease activated receptor 4 (PAR4) inhibitors for treating platelet aggregation US Patent US9518064 Publication Date 12/13/2016
 
Proteinase-activated receptor 4
Name:Proteinase-activated receptor 4
Type:Protein
Mol. Mass.:41145.16
Organism:Homo sapiens (Human)
Description:Q96RI0
Residue:385
BDBM286486
NameBDBM286486
Synonyms:US9518064, Example 105
TypeSmall organic molecule
Emp. Form.C28H23N5O4S
Mol. Mass.525.578
SMILESCOc1nn2cc(nc2s1)-c1cc2c(OCc3ccnc(n3)C3(CC3)c3ccccc3)cc(OC)cc2o1