Reaction Details
TargetProteinase-activated receptor 4
LigandBDBM286495
Substrate/Competitorn/a
Meas. Tech.FLIPR Assay
Temperature298.15±n/a K
IC50 0.310±n/a nM
Commentsextracted
Citation Martel, ATremblay, FMarinier, APriestley, ESPosy, SLLawrence, RMMiller, MM Imidazothiadiazole and imidazopyridazine derivatives as protease activated receptor 4 (PAR4) inhibitors for treating platelet aggregation US Patent US9518064 Publication Date 12/13/2016
 
Proteinase-activated receptor 4
Name:Proteinase-activated receptor 4
Type:Protein
Mol. Mass.:41145.16
Organism:Homo sapiens (Human)
Description:Q96RI0
Residue:385
BDBM286495
NameBDBM286495
Synonyms:(S)-2-(1-Fluoroethyl)-6-(4-((6-(4-fluorotetrahydro-2H-pyran-4-yl)pyridin-2-yl)methoxy)-6-methoxybenzo-furan-2-yl)imidazo[2,1-b][1,3,4]thiadiazole | US9518064, Example 114
TypeSmall organic molecule
Emp. Form.C26H24F2N4O4S
Mol. Mass.526.555
SMILESCOc1cc(OCc2cccc(n2)C2(F)CCOCC2)c2cc(oc2c1)-c1cn2nc(sc2n1)[C@H](C)F