Reaction Details
TargetProteinase-activated receptor 1
LigandBDBM286424
Substrate/Competitorn/a
Meas. Tech.FLIPR Assay
Temperature298.15±n/a K
IC50 2.86±n/a nM
Commentsextracted
Citation Martel, ATremblay, FMarinier, APriestley, ESPosy, SLLawrence, RMMiller, MM Imidazothiadiazole and imidazopyridazine derivatives as protease activated receptor 4 (PAR4) inhibitors for treating platelet aggregation US Patent US9518064 Publication Date 12/13/2016
 
Proteinase-activated receptor 1
Name:Proteinase-activated receptor 1
Type:Protein
Mol. Mass.:47450.07
Organism:Homo sapiens (Human)
Description:P25116
Residue:425
BDBM286424
NameBDBM286424
Synonyms:US9518064, Example 40
TypeSmall organic molecule
Emp. Form.C27H22N4O5S
Mol. Mass.514.552
SMILESCOc1nn2cc(nc2s1)-c1cc2c(OCc3cccc(c3)-c3ccc(OC)cn3)cc(OC)cc2o1