Reaction Details
TargetHeat shock protein HSP 90-alpha
LigandBDBM152278
Substrate/Competitorn/a
Meas. Tech.Biacore Assay
pH7.6±n/a
Kd 0.8±n/a nM
Commentsextracted
Citation Brasca, MGCasale, EFerguson, RPolucci, PZuccotto, F Resorcinol derivatives as HSP90 inhibitors US Patent US8993556 Publication Date 3/31/2015
 
Heat shock protein HSP 90-alpha
Name:Heat shock protein HSP 90-alpha
Type:Molecular Chaperone
Mol. Mass.:84623.45
Organism:Homo sapiens (Human)
Description:P07900
Residue:732
BDBM152278
NameBDBM152278
Synonyms:US8993556, N-[1-(4,4-Difluorocyclohexyl)piperidin-4-yl]-5-[2,4-dihydroxy-6-(4-nitrophenoxy)phenyl]isoxazole-3-carboxamide
TypeSmall organic molecule
Emp. Form.C27H28F2N4O7
Mol. Mass.558.5306
SMILESOc1cc(O)c(-c2cc(no2)C(=O)NC2CCN(CC2)C2CCC(F)(F)CC2)c(Oc2ccc(cc2)[N+]([O-])=O)c1