Reaction Details
Target1-deoxy-D-xylulose 5-phosphate reductoisomerase
LigandBDBM15236
Substrate/Competitorn/a
Meas. Tech.DXR Inhibition Assay
IC50 1.5e+3±n/a nM
Citation Tritsch, DZinglé, CRohmer, MGrosdemange-Billiard, C Flavonoids: true or promiscuous inhibitors of enzyme? The case of deoxyxylulose phosphate reductoisomerase. Bioorg Chem59:140-4 (2015) 
 
1-deoxy-D-xylulose 5-phosphate reductoisomerase
Name:1-deoxy-D-xylulose 5-phosphate reductoisomerase
Type:Protein
Mol. Mass.:43384.52
Organism:Escherichia coli
Description:P45568
Residue:398
BDBM15236
NameBDBM15236
Synonyms:3,5,7-trihydroxy-2-(3,4,5-trihydroxyphenyl)-4H-chromen-4-one CHEMBL164 Myricetin Myricetin (Myr) | cid_5281672
TypeSmall organic molecule
Emp. Form.C15H10O8
Mol. Mass.318.2351
SMILESOc1cc(O)c2c(c1)oc(-c1cc(O)c(O)c(O)c1)c(O)c2=O