Reaction Details
TargetHistone deacetylase 6
LigandBDBM152480
Substrate/Competitorn/a
Meas. Tech.HDAC Enzyme Activity Assay
IC50 29±0.0 nM
Citation Shahidul Islam, MNurul Islam, MAshraful Hoque, MNishino, NKato, TKim, HJIto, AYoshida, M An efficient synthesis of SK-658 and its analogs as potent histone deacetylase inhibitors. Bioorg Chem59:145-50 (2015) 
 
Histone deacetylase 6
Name:Histone deacetylase 6
Type:PROTEIN
Mol. Mass.:125762.28
Organism:Mus musculus
Description:ChEMBL_1460074
Residue:1149
BDBM152480
NameBDBM152480
Synonyms:Z-L-Am7(AcEtMe)-QA (2)
TypeSmall organic molecule
Emp. Form.C29H35N3O6S
Mol. Mass.553.67
SMILESCOCCOCC(=O)SCCCCC[C@H](NC(=O)OCc1ccccc1)C(=O)Nc1cccc2cccnc12