Reaction Details
TargetHistone deacetylase 6
LigandBDBM152482
Substrate/Competitorn/a
Meas. Tech.HDAC Enzyme Activity Assay
IC50 7.5±0.0 nM
Citation Shahidul Islam, MNurul Islam, MAshraful Hoque, MNishino, NKato, TKim, HJIto, AYoshida, M An efficient synthesis of SK-658 and its analogs as potent histone deacetylase inhibitors. Bioorg Chem59:145-50 (2015) 
 
Histone deacetylase 6
Name:Histone deacetylase 6
Type:PROTEIN
Mol. Mass.:125762.28
Organism:Mus musculus
Description:ChEMBL_1460074
Residue:1149
BDBM152482
NameBDBM152482
Synonyms:(Z-L-Am7(S-)-QA)2 (4)
TypeSmall organic molecule
Emp. Form.C48H52N6O6S2
Mol. Mass.873.093
SMILESO=C(NC(CCCCCSSCCCCC[C@H](NC(=O)OCc1ccccc1)C(=O)Nc1cccc2cccnc12)C(=O)Nc1cccc2cccnc12)OCc1ccccc1