Reaction Details
TargetThymidine phosphorylase
LigandBDBM50134399
Substrate/Competitorn/a
Meas. Tech.Thymidine Phosphorylase Inhibition Assay
pH7.4±n/a
IC50 3.868e+4± 4.42e+3 nM
Commentsextracted
Citation Shahzad, SAYar, MBajda, MShahzadi, LKhan, ZANaqvi, SAMutahir, SMahmood, NKhan, KM Synthesis, thymidine phosphorylase inhibition and molecular modeling studies of 1,3,4-oxadiazole-2-thione derivatives. Bioorg Chem60:37-41 (2015) 
 
Thymidine phosphorylase
Name:Thymidine phosphorylase
Type:Protein
Mol. Mass.:47171.52
Organism:Escherichia coli (Enterobacteria)
Description:n/a
Residue:440
BDBM50134399
NameBDBM50134399
Synonyms:1,7-Dihydro-pyrrolo[2,3-d]pyrimidine-2,4-dione 7-deazaxanthine | CHEMBL122899
TypeSmall organic molecule
Emp. Form.C6H5N3O2
Mol. Mass.151.1228
SMILESO=c1[nH]c2[nH]ccc2c(=O)[nH]1