Reaction Details
TargetNeuraminidase
LigandBDBM4997
Substrate/CompetitorBDBM4702
Meas. Tech.Neuraminidase Inhibition Assay
IC50 1±n/a nM
Citation Kim, CULew, WWilliams, MAWu, HZhang, LChen, XEscarpe, PAMendel, DBLaver, WGStevens, RC Structure-activity relationship studies of novel carbocyclic influenza neuraminidase inhibitors. J Med Chem41:2451-60 (1998) 
 
Neuraminidase
Name:Neuraminidase
Type:Enzyme
Mol. Mass.:50124.14
Organism:Influenza A virus (A/Puerto Rico/8/34/Mount Sinai(H1N1))
Description:P03468
Residue:454
BDBM4997
BDBM4702
NameBDBM4997
Synonyms:(3R,4R,5S)-4-Acetamido-5-amino-3-[(3S)-decyloxy]-1-cyclohexene-1-carboxylic Acid Carbocyclic Analogue 47
TypeSmall organic molecule
Emp. Form.C19H34N2O4
Mol. Mass.354.4843
SMILESCCCCCCC[C@H](CC)O[C@@H]1C=C(C[C@H](N)[C@H]1NC(C)=O)C(O)=O