Reaction Details
TargetNeuraminidase
LigandBDBM5013
Substrate/CompetitorBDBM4702
Meas. Tech.Neuraminidase Inhibition Assay
IC50 0.5±n/a nM
Citation Kim, CULew, WWilliams, MAWu, HZhang, LChen, XEscarpe, PAMendel, DBLaver, WGStevens, RC Structure-activity relationship studies of novel carbocyclic influenza neuraminidase inhibitors. J Med Chem41:2451-60 (1998) 
 
Neuraminidase
Name:Neuraminidase
Type:Enzyme
Mol. Mass.:50124.14
Organism:Influenza A virus (A/Puerto Rico/8/34/Mount Sinai(H1N1))
Description:P03468
Residue:454
BDBM5013
BDBM4702
NameBDBM5013
Synonyms:(3R,4R,5S)-4-Acetamido-5-guanidinyl-3-(1-ethylpropoxy)-1-cyclohexene-1-carboxylic acid Carbocyclic Analogue 63
TypeSmall organic molecule
Emp. Form.C15H26N4O4
Mol. Mass.326.3913
SMILESCCC(CC)O[C@@H]1C=C(C[C@H](N=C(N)N)[C@H]1NC(C)=O)C(O)=O