Reaction Details
TargetAcetylcholinesterase
LigandBDBM152500
Substrate/Competitorn/a
Meas. Tech.Acetylcholinesterase Inhibition Assay
pH8±n/a
Ki 3.53±0.0 nM
IC50 4.41±0.0 nM
Commentsextracted
Citation Öztaskin, NÇetinkaya, YTaslimi, PGöksu, SGülçin, Ä° Antioxidant and acetylcholinesterase inhibition properties of novel bromophenol derivatives. Bioorg Chem60:49-57 (2015) 
 
Acetylcholinesterase
Name:Acetylcholinesterase
Type:Enzyme
Mol. Mass.:67792.70
Organism:Homo sapiens (Human)
Description:P22303
Residue:614
BDBM152500
NameBDBM152500
Synonyms:(2-bromo-4-methoxyphenyl)(3,4-dimethoxyphenyl)methanone (10)
TypeSmall organic molecule
Emp. Form.C16H15BrO4
Mol. Mass.351.192
SMILESCOc1ccc(C(=O)c2ccc(OC)c(OC)c2)c(Br)c1