Reaction Details
TargetAcetylcholinesterase
LigandBDBM152501
Substrate/Competitorn/a
Meas. Tech.Acetylcholinesterase Inhibition Assay
pH8±n/a
Ki 4.34±0.0 nM
IC50 4.20±0.0 nM
Commentsextracted
Citation Öztaskin, NÇetinkaya, YTaslimi, PGöksu, SGülçin, Ä° Antioxidant and acetylcholinesterase inhibition properties of novel bromophenol derivatives. Bioorg Chem60:49-57 (2015) 
 
Acetylcholinesterase
Name:Acetylcholinesterase
Type:Enzyme
Mol. Mass.:67792.70
Organism:Homo sapiens (Human)
Description:P22303
Residue:614
BDBM152501
NameBDBM152501
Synonyms:(2-Bromo-4-methoxyphenyl)(2,3-dimethoxyphenyl)methanone (11)
TypeSmall organic molecule
Emp. Form.C16H15BrO4
Mol. Mass.351.192
SMILESCOc1ccc(C(=O)c2cccc(OC)c2OC)c(Br)c1