Reaction Details
TargetRibosyldihydronicotinamide dehydrogenase [quinone]
LigandBDBM50156669
Substrate/Competitorn/a
Meas. Tech.Fluorescence Titration Assay
Kd 18.1±0.4 nM
Citation Leung, KKShilton, BH Quinone reductase 2 is an adventitious target of protein kinase CK2 inhibitors TBBz (TBI) and DMAT. Biochemistry54:47-59 (2015) 
 
Ribosyldihydronicotinamide dehydrogenase [quinone]
Name:Ribosyldihydronicotinamide dehydrogenase [quinone]
Type:Protein
Mol. Mass.:25917.25
Organism:Homo sapiens (Human)
Description:P16083
Residue:231
BDBM50156669
NameBDBM50156669
Synonyms:4,5,6,7-TETRABROMO-BENZIMIDAZOLE 4,5,6,7-tetrabromo-1H-benzo[d]imidazole 4,5,6,7-tetrabromobenzimidazole | CHEMBL373937
TypeSmall organic molecule
Emp. Form.C7H2Br4N2
Mol. Mass.433.72
SMILESBrc1c(Br)c(Br)c2[nH]cnc2c1Br