Reaction Details
TargetRibosyldihydronicotinamide dehydrogenase [quinone]
LigandBDBM11323
Substrate/Competitorn/a
Meas. Tech.Inhibition of Steady-State Catalysis Assay
IC50 1.28e+4± 2e+3 nM
Citation Leung, KKShilton, BH Quinone reductase 2 is an adventitious target of protein kinase CK2 inhibitors TBBz (TBI) and DMAT. Biochemistry54:47-59 (2015) 
 
Ribosyldihydronicotinamide dehydrogenase [quinone]
Name:Ribosyldihydronicotinamide dehydrogenase [quinone]
Type:Protein
Mol. Mass.:25917.25
Organism:Homo sapiens (Human)
Description:P16083
Residue:231
BDBM11323
NameBDBM11323
Synonyms:4,5,6,7-tetrabromo-1H-1,2,3-benzotriazole CHEMBL177820 | TBB
TypeSmall organic molecule
Emp. Form.C6HBr4N3
Mol. Mass.434.708
SMILESBrc1c(Br)c(Br)c2[nH]nnc2c1Br