Reaction Details
TargetMetabotropic glutamate receptor 5
LigandBDBM143693
Substrate/Competitorn/a
Meas. Tech.Enzyme inhibition assay
Ki 18±n/a nM
Citation Jaeschke, GLindemann, LMartin, RERicci, ARueher, DStadler, HVieira, E Ethynyl derivatives US Patent US9682959 Publication Date 6/20/2017
 
Metabotropic glutamate receptor 5
Name:Metabotropic glutamate receptor 5
Type:Enzyme
Mol. Mass.:132484.72
Organism:Homo sapiens (Human)
Description:n/a
Residue:1212
BDBM143693
NameBDBM143693
Synonyms:US9682959, 1 | US9751856, 1
TypeSmall organic molecule
Emp. Form.C19H16FN3O
Mol. Mass.321.3482
SMILESCN1C(=O)C(C)(C)N=C1c1ccc(cn1)C#Cc1cccc(F)c1