Reaction Details
TargetMetabotropic glutamate receptor 5
LigandBDBM143698
Substrate/Competitorn/a
Meas. Tech.Enzyme inhibition assay
Ki 281±n/a nM
Citation Jaeschke, GLindemann, LMartin, RERicci, ARueher, DStadler, HVieira, E Ethynyl derivatives US Patent US9682959 Publication Date 6/20/2017
 
Metabotropic glutamate receptor 5
Name:Metabotropic glutamate receptor 5
Type:Enzyme
Mol. Mass.:132484.72
Organism:Homo sapiens (Human)
Description:n/a
Residue:1212
BDBM143698
NameBDBM143698
Synonyms:US9682959, 5 | US9751856, 5
TypeSmall organic molecule
Emp. Form.C18H16N4O
Mol. Mass.304.3458
SMILESCN1C(=O)C(C)(C)N=C1c1ncc(cn1)C#Cc1ccccc1