Reaction Details
TargetPeptidyl-prolyl cis-trans isomerase B
LigandBDBM286594
Substrate/Competitorn/a
Meas. Tech.Surface Plasmon Resonance (SPR) Assay
pH7.4±n/a
Kd 0.700±n/a nM
Commentsextracted
Citation Fu, JKarur, SLi, XLu, PMergo, WRivkin, ASweeney, ZKTjandra, MWeiss, AYifru, A Cyclic peptides and use as medicines US Patent US9566312 Publication Date 2/14/2017
 
Peptidyl-prolyl cis-trans isomerase B
Name:Peptidyl-prolyl cis-trans isomerase B
Type:Protein
Mol. Mass.:23751.82
Organism:Homo sapiens (Human)
Description:P23284
Residue:216
BDBM286594
NameBDBM286594
Synonyms:US9566312, Compound 2.17.12
TypeSmall organic molecule
Emp. Form.C68H124N12O14
Mol. Mass.1333.7842
SMILESCCCC[C@@H](C)[C@@H](O)[C@@H]1N(C)C(=O)[C@H](C(C)C)N(C)C(=O)[C@H](CC(C)C)N(C)C(=O)[C@H](CC(C)C)N(C)C(=O)[C@@H](C)NC(=O)[C@H](C)NC(=O)[C@H](CC(C)C)N(C)C(=O)[C@@H](NC(=O)[C@H]([C@@H](C)CN2CCO[C@H](COC)C2)N(C)C(=O)[C@@H](C)N(C)C(=O)[C@H](CC)NC1=O)C(C)C