Reaction Details
TargetPeptidyl-prolyl cis-trans isomerase B
LigandBDBM286607
Substrate/Competitorn/a
Meas. Tech.Surface Plasmon Resonance (SPR) Assay
pH7.4±n/a
Kd 0.400±n/a nM
Commentsextracted
Citation Fu, JKarur, SLi, XLu, PMergo, WRivkin, ASweeney, ZKTjandra, MWeiss, AYifru, A Cyclic peptides and use as medicines US Patent US9566312 Publication Date 2/14/2017
 
Peptidyl-prolyl cis-trans isomerase B
Name:Peptidyl-prolyl cis-trans isomerase B
Type:Protein
Mol. Mass.:23751.82
Organism:Homo sapiens (Human)
Description:P23284
Residue:216
BDBM286607
NameBDBM286607
Synonyms:US9566312, Compound 2.19.3
TypeSmall organic molecule
Emp. Form.C71H127N13O12
Mol. Mass.1354.848
SMILESCC[C@@H]1NC(=O)[C@H]([C@H](O)[C@H](C)C\C=C\C)N(C)C(=O)[C@H](C(C)C)N(C)C(=O)[C@H](CC(C)C)N(C)C(=O)[C@H](CC(C)C)N(C)C(=O)[C@@H](C)NC(=O)[C@H](C)NC(=O)[C@H](CC(C)C)N(C)C(=O)[C@@H](NC(=O)[C@H]([C@H](C)CCCN2CC3CCC(C2)N3C)N(C)C(=O)[C@@H](C)N(C)C1=O)C(C)C