Reaction Details
TargetAcetylpolyamine amidohydrolase
LigandBDBM152728
Substrate/Competitorn/a
Meas. Tech.APAH Fluorimetric Assay
pH8.2±n/a
IC50 1.7e+2± 1e+1 nM
Commentsextracted
Citation Decroos, CChristianson, DW Design, Synthesis, and Evaluation of Polyamine Deacetylase Inhibitors, and High-Resolution Crystal Structures of Their Complexes with Acetylpolyamine Amidohydrolase. Biochemistry54:4692-703 (2015) 
 
Acetylpolyamine amidohydrolase
Name:Acetylpolyamine amidohydrolase
Type:Protein
Mol. Mass.:36324.64
Organism:Mycoplana ramosa (Gram-negative bacterium)
Description:n/a
Residue:341
BDBM152728
NameBDBM152728
Synonyms:5-Amino-N-hydroxypentanamide (4)
TypeSmall organic molecule
Emp. Form.C5H13N2O2
Mol. Mass.133.1684
SMILES[NH3+]CCCCC(=O)NO