Reaction Details
TargetAcetylpolyamine amidohydrolase
LigandBDBM152731
Substrate/Competitorn/a
Meas. Tech.APAH Fluorimetric Assay
pH8.2±n/a
IC50 1.5e+2± 2e+1 nM
Commentsextracted
Citation Decroos, CChristianson, DW Design, Synthesis, and Evaluation of Polyamine Deacetylase Inhibitors, and High-Resolution Crystal Structures of Their Complexes with Acetylpolyamine Amidohydrolase. Biochemistry54:4692-703 (2015) 
 
Acetylpolyamine amidohydrolase
Name:Acetylpolyamine amidohydrolase
Type:Protein
Mol. Mass.:36324.64
Organism:Mycoplana ramosa (Gram-negative bacterium)
Description:n/a
Residue:341
BDBM152731
NameBDBM152731
Synonyms:8-Amino-N-hydroxypentanamide (7)
TypeSmall organic molecule
Emp. Form.C8H19N2O2
Mol. Mass.175.2481
SMILES[NH3+]CCCCCCCC(=O)NO