Reaction Details
TargetHistone deacetylase 8
LigandBDBM152725
Substrate/Competitorn/a
Meas. Tech.HDAC8 Fluorimetric Assay
pH8.2±n/a
IC50 2.6e+2± 2e+1 nM
Commentsextracted
Citation Decroos, CChristianson, DW Design, Synthesis, and Evaluation of Polyamine Deacetylase Inhibitors, and High-Resolution Crystal Structures of Their Complexes with Acetylpolyamine Amidohydrolase. Biochemistry54:4692-703 (2015) 
 
Histone deacetylase 8
Name:Histone deacetylase 8
Type:Enzyme
Mol. Mass.:41749.60
Organism:Homo sapiens (Human)
Description:Q9BY41
Residue:377
BDBM152725
NameBDBM152725
Synonyms:(3-azaniumylpropyl)(7,7,7-trifluoro-6-oxoheptyl)azanium (1)
TypeSmall organic molecule
Emp. Form.C10H21F3N2O
Mol. Mass.242.2807
SMILES[NH3+]CCC[NH2+]CCCCCC(=O)C(F)(F)F