Reaction Details
TargetNeuraminidase
LigandBDBM5025
Substrate/CompetitorBDBM4702
Meas. Tech.Neuraminidase Inhibition Assay
pH6.5±n/a
Temperature310.15±n/a K
IC50<1±n/a nM
Citation Chand, PKotian, PLDehghani, AEl-Kattan, YLin, THHutchison, TLBabu, YSBantia, SElliott, AJMontgomery, JA Systematic structure-based design and stereoselective synthesis of novel multisubstituted cyclopentane derivatives with potent antiinfluenza activity. J Med Chem44:4379-92 (2001) 
 
Neuraminidase
Name:Neuraminidase
Type:Enzyme
Mol. Mass.:52000.86
Organism:Influenza A virus (A/Singapore/1/57(H2N2))
Description:Q6XUE4
Residue:469
BDBM5025
BDBM4702
NameBDBM5025
Synonyms:Oseltamivir ethyl (3R,4R,5S)-5-amino-4-acetamido-3-(pentan-3-yloxy)cyclohex-1-ene-1-carboxylate
TypeSmall organic molecule
Emp. Form.C16H28N2O4
Mol. Mass.312.4045
SMILES[H][C@@]1(OC(CC)CC)C=C(C[C@H](N)[C@H]1NC(C)=O)C(=O)OCC