Reaction Details
Target5-hydroxytryptamine receptor 1A
LigandBDBM50010859
Substrate/Competitorn/a
Meas. Tech.Radioligand Binding Assays
Temperature298.15±n/a K
Ki>10000±0.0 nM
Commentsextracted
Citation Waszkielewicz, AMPytka, KRapacz, AWelna, EJarzyna, MSatala, GBojarski, ASapa, JZmudzki, PFilipek, BMarona, H Synthesis and evaluation of antidepressant-like activity of some 4-substituted 1-(2-methoxyphenyl)piperazine derivatives. Chem Biol Drug Des85:326-35 (2015) 
 
5-hydroxytryptamine receptor 1A
Name:5-hydroxytryptamine receptor 1A
Type:n/a
Mol. Mass.:46122.49
Organism:Homo sapiens (Human)
Description:n/a
Residue:422
BDBM50010859
NameBDBM50010859
Synonyms:CHEMBL11 IMIPRAMINE PAMOATE | Imipramin
TypeSmall organic molecule
Emp. Form.C19H24N2
Mol. Mass.280.4073
SMILESCN(C)CCCN1c2ccccc2CCc2ccccc12