Reaction Details
TargetProstaglandin G/H synthase 1
LigandBDBM50029593
Substrate/Competitorn/a
Meas. Tech.In vitro Cyclooxygenase Inhibition Assay
pH8±n/a
Temperature298.15±n/a K
IC50 2.132e+5±n/a nM
Commentsextracted
Citation Irannejad, HUnsal Tan, OOzadali, KDadashpour, STuylu Kucukkilinc, TAhangar, NAhmadnejad, MEmami, S 1,2-Diaryl-2-hydroxyiminoethanones as dual COX-1 and ß-amyloid aggregation inhibitors: biological evaluation and in silico study. Chem Biol Drug Des85:494-503 (2015) 
 
Prostaglandin G/H synthase 1
Name:Prostaglandin G/H synthase 1
Type:Protein
Mol. Mass.:68868.60
Organism:Ovis aries (Sheep)
Description:n/a
Residue:600
BDBM50029593
NameBDBM50029593
Synonyms:CHEMBL7162 N-(2-Cyclohexyloxy-4-nitro-phenyl)-methanesulfonamide N-[2-(cyclohexyloxy)-4-nitrophenyl]methane sulfonamide N-{2-(cyclohexyloxy)-4-[hydroxy(oxido)amino]phenyl}methanesulfonamide NS398
TypeSmall organic molecule
Emp. Form.C13H18N2O5S
Mol. Mass.314.357
SMILESCS(=O)(=O)Nc1ccc(cc1OC1CCCCC1)[N+]([O-])=O