Reaction Details
Target2-acylglycerol O-acyltransferase 2
LigandBDBM152809
Substrate/Competitorn/a
Meas. Tech.Inhibition Assay
Temperature277.15±n/a K
IC50 16±n/a nM
Commentsextracted
Citation Gonzalez-Garcia, MRFernandez, MC Morpholinyl derivatives useful as MOGAT-2 inhibitors US Patent US8993568 Publication Date 3/31/2015
 
2-acylglycerol O-acyltransferase 2
Name:2-acylglycerol O-acyltransferase 2
Type:Enzyme
Mol. Mass.:38210.80
Organism:Homo sapiens (Human)
Description:Q3SYC2
Residue:334
BDBM152809
NameBDBM152809
Synonyms:US8993568, 5
TypeSmall organic molecule
Emp. Form.C20H22ClF3N2O3S
Mol. Mass.462.913
SMILESCS(=O)(=O)N[C@@H](c1ccc(CN2CCOC(C2)c2ccccc2Cl)cc1)C(F)(F)F