Reaction Details
TargetAcetyl-CoA carboxylase 1
LigandBDBM152873
Substrate/Competitorn/a
Meas. Tech.Inhibition Assay
pH7.5±n/a
IC50 15±n/a nM
Commentsextracted
Citation Griffith, DADow, RLBagley, SWSmith, A N1/N2-lactam acetyl-CoA carboxylase inhibitors US Patent US8993586 Publication Date 3/31/2015
 
Acetyl-CoA carboxylase 1
Name:Acetyl-CoA carboxylase 1
Type:Protein
Mol. Mass.:265543.22
Organism:Homo sapiens (Human)
Description:Q13085
Residue:2346
BDBM152873
NameBDBM152873
Synonyms:US8993586, 51
TypeSmall organic molecule
Emp. Form.C26H31N5O4
Mol. Mass.477.5554
SMILESCOc1cccc2c(OC)cc(nc12)C(=O)N1CCC2(CC1)Cc1cn(nc1C(=O)N2)C(C)(C)C