Reaction Details
TargetAcetyl-CoA carboxylase 1
LigandBDBM152913
Substrate/Competitorn/a
Meas. Tech.Inhibition Assay
pH7.5±n/a
IC50 3.4±n/a nM
Commentsextracted
Citation Griffith, DADow, RLBagley, SWSmith, A N1/N2-lactam acetyl-CoA carboxylase inhibitors US Patent US8993586 Publication Date 3/31/2015
 
Acetyl-CoA carboxylase 1
Name:Acetyl-CoA carboxylase 1
Type:Protein
Mol. Mass.:265543.22
Organism:Homo sapiens (Human)
Description:Q13085
Residue:2346
BDBM152913
NameBDBM152913
Synonyms:US8993586, 109
TypeSmall organic molecule
Emp. Form.C28H34N6O2
Mol. Mass.486.6086
SMILESCC(C)(C)n1cc2CC3(CCN(CC3)C(=O)c3ccc4ccc(NC5CCC5)nc4c3)NC(=O)c2n1