Reaction Details
TargetAcetyl-CoA carboxylase 2
LigandBDBM152868
Substrate/Competitorn/a
Meas. Tech.Inhibition Assay
IC50 5.3±n/a nM
Citation Griffith, DADow, RLBagley, SWSmith, A N1/N2-lactam acetyl-CoA carboxylase inhibitors US Patent US8993586 Publication Date 3/31/2015
 
Acetyl-CoA carboxylase 2
Name:Acetyl-CoA carboxylase 2
Type:Protein
Mol. Mass.:276535.21
Organism:Homo sapiens (Human)
Description:O00763
Residue:2458
BDBM152868
NameBDBM152868
Synonyms:US8993586, 46
TypeSmall organic molecule
Emp. Form.C26H30N4O3
Mol. Mass.446.5414
SMILESCOc1ccc2cc(ccc2c1)C(=O)N1CCC2(CC1)Cc1cn(nc1C(=O)N2)C(C)(C)C