Reaction Details
TargetAcetyl-CoA carboxylase 2
LigandBDBM50439646
Substrate/Competitorn/a
Meas. Tech.Inhibition Assay
IC50 1.1±n/a nM
Citation Griffith, DADow, RLBagley, SWSmith, A N1/N2-lactam acetyl-CoA carboxylase inhibitors US Patent US8993586 Publication Date 3/31/2015
 
Acetyl-CoA carboxylase 2
Name:Acetyl-CoA carboxylase 2
Type:Protein
Mol. Mass.:276535.21
Organism:Homo sapiens (Human)
Description:O00763
Residue:2458
BDBM50439646
NameBDBM50439646
Synonyms:CHEMBL2419600 | US8993586, 110
TypeSmall organic molecule
Emp. Form.C27H34N6O2
Mol. Mass.474.5979
SMILESCCCNc1ccc2ccc(cc2n1)C(=O)N1CCC2(CC1)Cc1cn(nc1C(=O)N2)C(C)(C)C