Reaction Details
TargetAcetyl-CoA carboxylase 2
LigandBDBM152921
Substrate/Competitorn/a
Meas. Tech.Inhibition Assay
IC50 2.7±n/a nM
Citation Griffith, DADow, RLBagley, SWSmith, A N1/N2-lactam acetyl-CoA carboxylase inhibitors US Patent US8993586 Publication Date 3/31/2015
 
Acetyl-CoA carboxylase 2
Name:Acetyl-CoA carboxylase 2
Type:Protein
Mol. Mass.:276535.21
Organism:Homo sapiens (Human)
Description:O00763
Residue:2458
BDBM152921
NameBDBM152921
Synonyms:US8993586, 118
TypeSmall organic molecule
Emp. Form.C28H34N6O2
Mol. Mass.486.6086
SMILESCC(C)(C)n1cc2CC3(CCN(CC3)C(=O)c3ccc4ccnc(NC5CCC5)c4c3)NC(=O)c2n1