Reaction Details
TargetCalcium release-activated calcium channel protein 1
LigandBDBM152938
Substrate/Competitorn/a
Meas. Tech.Inhibition Assay
Temperature310.15±n/a K
IC50 139±n/a nM
Commentsextracted
Citation Muthuppalaniappan, MViswanadha, SVaranasi, KVMerikapudi, GSVakkalanka, SK Modulators of calcium release-activated calcium channel and methods for treatment of non-small cell lung cancer US Patent US8993612 Publication Date 3/31/2015
 
Calcium release-activated calcium channel protein 1
Name:Calcium release-activated calcium channel protein 1
Type:Protein
Mol. Mass.:32676.63
Organism:Homo sapiens (Human)
Description:Q96D31
Residue:301
BDBM152938
NameBDBM152938
Synonyms:US8993612, 21
TypeSmall organic molecule
Emp. Form.C21H17F3N6O
Mol. Mass.426.3945
SMILESFC(F)(F)c1cc(C2CC2)n(n1)-c1ccc(NC(=O)Cn2nc3ccccc3n2)cc1