Reaction Details
TargetTyrosine-protein kinase JAK3
LigandBDBM153184
Substrate/Competitorn/a
Meas. Tech.HTRF Assay
Temperature298.15±n/a K
IC50 0.087±n/a nM
Commentsextracted
Citation Ahearn, SPChristopher, MDinsmore, CJung, JPu, QRivkin, AScott, MEWitter, DJWoo, HCCash, B Pyrrolopyrimidines as janus kinase inhibitors US Patent US8993756 Publication Date 3/31/2015
 
Tyrosine-protein kinase JAK3
Name:Tyrosine-protein kinase JAK3
Type:Protein
Mol. Mass.:125111.08
Organism:Homo sapiens (Human)
Description:P52333
Residue:1124
BDBM153184
NameBDBM153184
Synonyms:US8993756, 4-29
TypeSmall organic molecule
Emp. Form.C20H20N4O5S
Mol. Mass.428.462
SMILESCCOC(=O)c1c[nH]c2ncnc(-c3ccc(c(NC(=O)C(C)=C)c3)S(C)(=O)=O)c12