Reaction Details
TargetTyrosine-protein kinase JAK3
LigandBDBM153227
Substrate/Competitorn/a
Meas. Tech.HTRF Assay
Temperature298.15±n/a K
IC50 0.016±n/a nM
Commentsextracted
Citation Ahearn, SPChristopher, MDinsmore, CJung, JPu, QRivkin, AScott, MEWitter, DJWoo, HCCash, B Pyrrolopyrimidines as janus kinase inhibitors US Patent US8993756 Publication Date 3/31/2015
 
Tyrosine-protein kinase JAK3
Name:Tyrosine-protein kinase JAK3
Type:Protein
Mol. Mass.:125111.08
Organism:Homo sapiens (Human)
Description:P52333
Residue:1124
BDBM153227
NameBDBM153227
Synonyms:US10421760, Comparative Example 12 | US8993756, 20-9
TypeSmall organic molecule
Emp. Form.C21H16N4O
Mol. Mass.340.3779
SMILESC=CC(=O)Nc1cccc(c1)-c1ncnc2[nH]cc(-c3ccccc3)c12