Reaction Details
TargetAurora kinase B
LigandBDBM153263
Substrate/Competitorn/a
Meas. Tech.Aurora B Kinase Assay
IC50 4.270e+4±n/a nM
Citation Jung, YShin, SYYong, YJung, HAhn, SLee, YHLim, Y Plant-derived flavones as inhibitors of aurora B kinase and their quantitative structure-activity relationships. Chem Biol Drug Des85:574-85 (2015) 
 
Aurora kinase B
Name:Aurora kinase B
Type:Protein
Mol. Mass.:39327.72
Organism:Homo sapiens (Human)
Description:Q96GD4
Residue:344
BDBM153263
NameBDBM153263
Synonyms:5-hydroxy-6,7,8-trimethoxy-2-(3,4,5-trimethoxyphenyl)chromen-4-one | Gardenin (1)
TypeSmall organic molecule
Emp. Form.C21H22O9
Mol. Mass.418.394
SMILESCOc1cc(cc(OC)c1OC)-c1cc(=O)c2c(O)c(OC)c(OC)c(OC)c2o1