Reaction Details
TargetAurora kinase B
LigandBDBM50338975
Substrate/Competitorn/a
Meas. Tech.Aurora B Kinase Assay
IC50 5.31e+3±n/a nM
Citation Jung, YShin, SYYong, YJung, HAhn, SLee, YHLim, Y Plant-derived flavones as inhibitors of aurora B kinase and their quantitative structure-activity relationships. Chem Biol Drug Des85:574-85 (2015) 
 
Aurora kinase B
Name:Aurora kinase B
Type:Protein
Mol. Mass.:39327.72
Organism:Homo sapiens (Human)
Description:Q96GD4
Residue:344
BDBM50338975
NameBDBM50338975
Synonyms:2-(3,4-dimethoxyphenyl)-5,6,7-trimethoxy-4H-chromen-4-one 5,6,7,3',4' -pentamethoxyflavone Sinensetin (3) | sinensetin
TypeSmall organic molecule
Emp. Form.C20H20O7
Mol. Mass.372.3686
SMILESCOc1ccc(cc1OC)-c1cc(=O)c2c(OC)c(OC)c(OC)cc2o1