Reaction Details
TargetAurora kinase B
LigandBDBM50362884
Substrate/Competitorn/a
Meas. Tech.Aurora B Kinase Assay
IC50 2.937e+4±n/a nM
Citation Jung, YShin, SYYong, YJung, HAhn, SLee, YHLim, Y Plant-derived flavones as inhibitors of aurora B kinase and their quantitative structure-activity relationships. Chem Biol Drug Des85:574-85 (2015) 
 
Aurora kinase B
Name:Aurora kinase B
Type:Protein
Mol. Mass.:39327.72
Organism:Homo sapiens (Human)
Description:Q96GD4
Residue:344
BDBM50362884
NameBDBM50362884
Synonyms:CHEMBL402947 | Spiraeoside (5)
TypeSmall organic molecule
Emp. Form.C21H20O12
Mol. Mass.464.3763
SMILESOC[C@H]1O[C@@H](Oc2ccc(cc2O)-c2oc3cc(O)cc(O)c3c(=O)c2O)[C@H](O)[C@@H](O)[C@@H]1O