Reaction Details
TargetAurora kinase B
LigandBDBM153268
Substrate/Competitorn/a
Meas. Tech.Aurora B Kinase Assay
IC50 1.214e+4±n/a nM
Citation Jung, YShin, SYYong, YJung, HAhn, SLee, YHLim, Y Plant-derived flavones as inhibitors of aurora B kinase and their quantitative structure-activity relationships. Chem Biol Drug Des85:574-85 (2015) 
 
Aurora kinase B
Name:Aurora kinase B
Type:Protein
Mol. Mass.:39327.72
Organism:Homo sapiens (Human)
Description:Q96GD4
Residue:344
BDBM153268
NameBDBM153268
Synonyms:7-[(2S,3R,4S,5S,6R)-3-[(2S,3R,4R)-3,4-dihydroxy-4-(hydroxymethyl)oxolan-2-yl]oxy-4,5-dihydroxy-6-(hydroxymethyl)oxan-2-yl]oxy-5-hydroxy-2-(4-hydroxyphenyl)chromen-4-one | Apiin (11)
TypeSmall organic molecule
Emp. Form.C26H28O14
Mol. Mass.564.4921
SMILESOC[C@H]1O[C@@H](Oc2cc(O)c3c(c2)oc(cc3=O)-c2ccc(O)cc2)[C@H](O[C@@H]2OC[C@](O)(CO)[C@H]2O)[C@@H](O)[C@@H]1O