Reaction Details
TargetAurora kinase B
LigandBDBM15236
Substrate/Competitorn/a
Meas. Tech.Aurora B Kinase Assay
IC50 3.98e+3±n/a nM
Citation Jung, YShin, SYYong, YJung, HAhn, SLee, YHLim, Y Plant-derived flavones as inhibitors of aurora B kinase and their quantitative structure-activity relationships. Chem Biol Drug Des85:574-85 (2015) 
 
Aurora kinase B
Name:Aurora kinase B
Type:Protein
Mol. Mass.:39327.72
Organism:Homo sapiens (Human)
Description:Q96GD4
Residue:344
BDBM15236
NameBDBM15236
Synonyms:3,5,7-trihydroxy-2-(3,4,5-trihydroxyphenyl)-4H-chromen-4-one CHEMBL164 Myricetin Myricetin (Myr) | cid_5281672
TypeSmall organic molecule
Emp. Form.C15H10O8
Mol. Mass.318.2351
SMILESOc1cc(O)c2c(c1)oc(-c1cc(O)c(O)c(O)c1)c(O)c2=O