Reaction Details
TargetAurora kinase B
LigandBDBM26655
Substrate/Competitorn/a
Meas. Tech.Aurora B Kinase Assay
IC50 4.10e+3±n/a nM
Citation Jung, YShin, SYYong, YJung, HAhn, SLee, YHLim, Y Plant-derived flavones as inhibitors of aurora B kinase and their quantitative structure-activity relationships. Chem Biol Drug Des85:574-85 (2015) 
 
Aurora kinase B
Name:Aurora kinase B
Type:Protein
Mol. Mass.:39327.72
Organism:Homo sapiens (Human)
Description:Q96GD4
Residue:344
BDBM26655
NameBDBM26655
Synonyms:2-(3,4-dihydroxyphenyl)-3,5,7,8-tetrahydroxy-4H-chromen-4-one Gossypetin (23) | gossypetin
TypeFlavonoid
Emp. Form.C15H10O8
Mol. Mass.318.2351
SMILESOc1ccc(cc1O)-c1oc2c(O)c(O)cc(O)c2c(=O)c1O