Reaction Details
TargetAurora kinase B
LigandBDBM23414
Substrate/Competitorn/a
Meas. Tech.Aurora B Kinase Assay
IC50 3.86e+3±n/a nM
Citation Jung, YShin, SYYong, YJung, HAhn, SLee, YHLim, Y Plant-derived flavones as inhibitors of aurora B kinase and their quantitative structure-activity relationships. Chem Biol Drug Des85:574-85 (2015) 
 
Aurora kinase B
Name:Aurora kinase B
Type:Protein
Mol. Mass.:39327.72
Organism:Homo sapiens (Human)
Description:Q96GD4
Residue:344
BDBM23414
NameBDBM23414
Synonyms:5,7-dihydroxy-2-(3-hydroxy-4-methoxyphenyl)-4H-chromen-4-one Diosmetin (25)
Typeflavone
Emp. Form.C16H12O6
Mol. Mass.300.2629
SMILESCOc1ccc(cc1O)-c1cc(=O)c2c(O)cc(O)cc2o1