Reaction Details
TargetFatty acid-binding protein, intestinal
LigandBDBM50074922
Substrate/Competitorn/a
Meas. Tech.Fluorophore Displacement Assay
Temperature566.3±0 K
Ki 2.32e+4± 6.2e+3 nM
Citation Patil, RLaguerre, AWielens, JHeadey, SJWilliams, MLHughes, MLMohanty, BPorter, CJScanlon, MJ Characterization of two distinct modes of drug binding to human intestinal fatty acid binding protein. ACS Chem Biol9:2526-34 (2014) 
 
Fatty acid-binding protein, intestinal
Name:Fatty acid-binding protein, intestinal
Type:Protein
Mol. Mass.:15207.56
Organism:Homo sapiens (Human)
Description:n/a
Residue:132
BDBM50074922
NameBDBM50074922
Synonyms:(+-)-2-fluoro-alpha-methyl-4-biphenylacetic acid 2-(2-fluorobiphenyl-4-yl)propanoic acid 3-fluoro-4-phenylhydratropic acid CHEMBL563 US9630914, Compound A
TypeSmall organic molecule
Emp. Form.C15H13FO2
Mol. Mass.244.2609
SMILESCC(C(O)=O)c1ccc(c(F)c1)-c1ccccc1