Reaction Details
TargetDecaprenyl diphosphate synthase
LigandBDBM153319
Substrate/Competitorn/a
Meas. Tech.DPPS Inhibition (GPP based) Assay
pH7.5±n/a
IC50 5.7e+2±n/a nM
Commentsextracted
Citation Kim, MOFeng, XFeixas, FZhu, WLindert, SBogue, SSinko, Wde Oliveira, CRao, GOldfield, EMcCammon, JA A Molecular Dynamics Investigation of Mycobacterium tuberculosis Prenyl Synthases: Conformational Flexibility and Implications for Computer-aided Drug Discovery. Chem Biol Drug Des85:756-69 (2015) 
 
Decaprenyl diphosphate synthase
Name:Decaprenyl diphosphate synthase
Type:Protein
Mol. Mass.:33800.02
Organism:Mycobacterium tuberculosis H37Rv
Description:n/a
Residue:296
BDBM153319
NameBDBM153319
Synonyms:BPH-1419
TypeSmall organic molecule
Emp. Form.C26H22Br2N2
Mol. Mass.522.274
SMILESNCCc1cc(Br)cc(c1)C#Cc1ccc(cc1)C#Cc1cc(Br)cc(CCN)c1