Reaction Details
TargetDecaprenyl diphosphate synthase
LigandBDBM153323
Substrate/Competitorn/a
Meas. Tech.DPPS Inhibition (GPP based) Assay
pH7.5±n/a
IC50 1.2e+3±n/a nM
Commentsextracted
Citation Kim, MOFeng, XFeixas, FZhu, WLindert, SBogue, SSinko, Wde Oliveira, CRao, GOldfield, EMcCammon, JA A Molecular Dynamics Investigation of Mycobacterium tuberculosis Prenyl Synthases: Conformational Flexibility and Implications for Computer-aided Drug Discovery. Chem Biol Drug Des85:756-69 (2015) 
 
Decaprenyl diphosphate synthase
Name:Decaprenyl diphosphate synthase
Type:Protein
Mol. Mass.:33800.02
Organism:Mycobacterium tuberculosis H37Rv
Description:n/a
Residue:296
BDBM153323
NameBDBM153323
Synonyms:BPH-1125
TypeSmall organic molecule
Emp. Form.C20H16O3S
Mol. Mass.336.404
SMILESOC(=O)c1ccccc1SCc1cccc(Oc2ccccc2)c1