Reaction Details
TargetDecaprenyl diphosphate synthase
LigandBDBM153334
Substrate/Competitorn/a
Meas. Tech.DPPS Inhibition (GPP based) Assay
pH7.5±n/a
IC50 5.8e+3±n/a nM
Commentsextracted
Citation Kim, MOFeng, XFeixas, FZhu, WLindert, SBogue, SSinko, Wde Oliveira, CRao, GOldfield, EMcCammon, JA A Molecular Dynamics Investigation of Mycobacterium tuberculosis Prenyl Synthases: Conformational Flexibility and Implications for Computer-aided Drug Discovery. Chem Biol Drug Des85:756-69 (2015) 
 
Decaprenyl diphosphate synthase
Name:Decaprenyl diphosphate synthase
Type:Protein
Mol. Mass.:33800.02
Organism:Mycobacterium tuberculosis H37Rv
Description:n/a
Residue:296
BDBM153334
NameBDBM153334
Synonyms:BPH-1413
TypeSmall organic molecule
Emp. Form.C30H32N6O2
Mol. Mass.508.6141
SMILESO=C(Nc1ccc(CCC2=NCCN2)cc1)c1ccc(cc1)C(=O)Nc1ccc(CCC2=NCCN2)cc1