Reaction Details
TargetDecaprenyl diphosphate synthase
LigandBDBM153336
Substrate/Competitorn/a
Meas. Tech.DPPS Inhibition (GPP based) Assay
pH7.5±n/a
IC50 7.0e+3±n/a nM
Commentsextracted
Citation Kim, MOFeng, XFeixas, FZhu, WLindert, SBogue, SSinko, Wde Oliveira, CRao, GOldfield, EMcCammon, JA A Molecular Dynamics Investigation of Mycobacterium tuberculosis Prenyl Synthases: Conformational Flexibility and Implications for Computer-aided Drug Discovery. Chem Biol Drug Des85:756-69 (2015) 
 
Decaprenyl diphosphate synthase
Name:Decaprenyl diphosphate synthase
Type:Protein
Mol. Mass.:33800.02
Organism:Mycobacterium tuberculosis H37Rv
Description:n/a
Residue:296
BDBM153336
NameBDBM153336
Synonyms:BPH-1474
TypeSmall organic molecule
Emp. Form.C20H28NO2
Mol. Mass.314.4413
SMILESCCCCCCC1=C(C[N+](C)(C)C)C(=O)c2ccccc2C1=O