Reaction Details
TargetDecaprenyl diphosphate synthase
LigandBDBM153316
Substrate/Competitorn/a
Meas. Tech.DPPS Inhibition (cis FPP based) Assay
pH7.5±n/a
IC50 6.1e+2±n/a nM
Commentsextracted
Citation Kim, MOFeng, XFeixas, FZhu, WLindert, SBogue, SSinko, Wde Oliveira, CRao, GOldfield, EMcCammon, JA A Molecular Dynamics Investigation of Mycobacterium tuberculosis Prenyl Synthases: Conformational Flexibility and Implications for Computer-aided Drug Discovery. Chem Biol Drug Des85:756-69 (2015) 
 
Decaprenyl diphosphate synthase
Name:Decaprenyl diphosphate synthase
Type:Protein
Mol. Mass.:33800.02
Organism:Mycobacterium tuberculosis H37Rv
Description:n/a
Residue:296
BDBM153316
NameBDBM153316
Synonyms:BPH-640
TypeSmall organic molecule
Emp. Form.C19H18O7P2
Mol. Mass.420.2895
SMILESOC(c1cccc(c1)-c1cccc(c1)-c1ccccc1)(P(O)(O)=O)P(O)(O)=O