Reaction Details
TargetDecaprenyl diphosphate synthase
LigandBDBM153348
Substrate/Competitorn/a
Meas. Tech.DPPS Inhibition (trans FPP based) Assay
pH7.5±n/a
IC50 1.7e+3±n/a nM
Commentsextracted
Citation Kim, MOFeng, XFeixas, FZhu, WLindert, SBogue, SSinko, Wde Oliveira, CRao, GOldfield, EMcCammon, JA A Molecular Dynamics Investigation of Mycobacterium tuberculosis Prenyl Synthases: Conformational Flexibility and Implications for Computer-aided Drug Discovery. Chem Biol Drug Des85:756-69 (2015) 
 
Decaprenyl diphosphate synthase
Name:Decaprenyl diphosphate synthase
Type:Protein
Mol. Mass.:33800.02
Organism:Mycobacterium tuberculosis H37Rv
Description:n/a
Residue:296
BDBM153348
NameBDBM153348
Synonyms:BPH-309
TypeSmall organic molecule
Emp. Form.C14H13F2NaO7P2
Mol. Mass.416.1829
SMILESOC(Cc1cccc(c1)-c1cc(F)cc(F)c1)(P(O)(O)=O)P(O)(=O)O[Na]