Reaction Details
TargetRAC-alpha serine/threonine-protein kinase
LigandBDBM15211
Substrate/Competitorn/a
Meas. Tech.Akt1 Inhibitory Activity Assay
pH7.5±n/a
Temperature298.15±n/a K
IC50 1.7e+3± 2e+2 nM
Commentsextracted
Citation Zhan, WLin, SChen, JDong, XChu, JDu, W Design, synthesis, biological evaluation, and molecular docking of novel benzopyran and phenylpyrazole derivatives as Akt inhibitors. Chem Biol Drug Des85:770-9 (2015) 
 
RAC-alpha serine/threonine-protein kinase
Name:RAC-alpha serine/threonine-protein kinase
Type:Enzyme
Mol. Mass.:55681.25
Organism:Homo sapiens (Human)
Description:P31749
Residue:480
BDBM15211
NameBDBM15211
Synonyms:CHEMBL104264 H89 N-(2-{[(2E)-3-(4-bromophenyl)prop-2-en-1-yl]amino}ethyl)isoquinoline-5-sulfonamide | N-[2-[[(E)-3-(4-bromophenyl)prop-2-enyl]amino]ethyl]isoquinoline-5-sulfonamide
TypeSmall organic molecule
Emp. Form.C20H20BrN3O2S
Mol. Mass.446.361
SMILESBrc1ccc(\C=C\CNCCNS(=O)(=O)c2cccc3cnccc23)cc1